smartsnippets linker error with ble_range_dte

Hi there.. thanks for coming to the forums. Exciting news! we’re now in the process of moving to our new forum platform that will offer better functionality and is contained within the main Dialog website. All posts and accounts have been migrated. We’re now accepting traffic on the new forum only - please POST any new threads at . We’ll be fixing bugs / optimising the searching and tagging over the coming days.
2 posts / 0 new
Last post
Last seen: 7 months 1 week ago
Joined: 2020-10-15 16:12
smartsnippets linker error with ble_range_dte

I'm getting the following linker error when trying to compile the ble_range_dte example for the DA14695 dev kit


Building target: ble_range_dte.elf
Invoking: Cross ARM C Linker
c:/diasemi/smartsnippetsstudio2.0.16/gcc/7-2018-q2/bin/../lib/gcc/arm-none-eabi/7.3.1/../../../../arm-none-eabi/bin/ld.exe: cannot find -lc_p-lc_p
collect2.exe: error: ld returned 1 exit status
make[1]: *** [makefile:78: ble_range_dte.elf] Error 1
make: *** [makefile:69: all] Error 2
"make --silent all" terminated with exit code 2. Build might be incomplete.

08:40:49 Build Failed. 3 errors, 5 warnings. (took 2m:37s.317ms)

Last seen: 9 months 2 days ago
Joined: 2018-02-08 11:03
Hi apdobaj,

Hi apdobaj,

Thanks for your post online. Apologies but I am not able to replicate this with the ble_range_dte example and WiRa SDK.

I am following the procedure described in the user guide and section “Build the application”.

Can you please follow this procedure in a clean WiRa SDK directory? What is the version of SmartSnippets Studio that you are using?

Thanks, PM_Dialog